Target
Orexin receptor type 2
Ligand
BDBM347787
Substrate
Meas. Tech.
FLIPR Assay
IC50
>10000±n/a nM
Citation
 Fieldhouse, CGlen, AFujimoto, TRobinson, JS Substituted cyclopentanes, tetrahydrofuranes and pyrrolidines as orexin receptor antagonists US Patent  US9790220 Publication Date 10/17/2017 
Target
Name:
Orexin receptor type 2
Synonyms:
HCRTR2 OX2R_HUMAN Orexin receptor type 2 (OR-2) Orexin receptor type 2 (OX2R) Ox-2-R | Ox2-R
Type:
Protein
Mol. Mass.:
50710.53
Organism:
Homo sapiens (Human)
Description:
O43614
Residue:
444
  
Inhibitor
Name:
BDBM347787
Synonyms:
US9790220, Example 20
Type:
Small organic molecule
Emp. Form.:
C19H17F3N4O2S
Mol. Mass.:
422.424
SMILES:
FC(F)Oc1cccnc1C(=O)N[C@H]1CCC[C@@H]1Nc1nc2ccc(F)cc2s1
: