Target
Orexin/Hypocretin receptor type 1
Ligand
BDBM347788
Substrate
Meas. Tech.
FLIPR Assay
IC50
24.0±n/a nM
Citation
 Fieldhouse, CGlen, AFujimoto, TRobinson, JS Substituted cyclopentanes, tetrahydrofuranes and pyrrolidines as orexin receptor antagonists US Patent  US9790220 Publication Date 10/17/2017 
Target
Name:
Orexin/Hypocretin receptor type 1
Synonyms:
HCRTR1 OX1R_HUMAN Orexin receptor type 1 (OR 1) Orexin receptor type 1 (OX1) Orexin receptor type 1 (OxR1) | Ox1r
Type:
Protein
Mol. Mass.:
47554.50
Organism:
Homo sapiens (Human)
Description:
O43613
Residue:
425
  
Inhibitor
Name:
BDBM347788
Synonyms:
US9790220, Example 21
Type:
Small organic molecule
Emp. Form.:
C20H18ClN7OS
Mol. Mass.:
439.921
SMILES:
Clc1ccc2nc(N[C@H]3CCC[C@@H]3NC(=O)c3ncccc3-n3nccn3)sc2c1
: