Target
Interleukin-1 receptor-associated kinase 4
Ligand
BDBM348008
Substrate
Meas. Tech.
Enzymatic Assay
IC50
<100±n/a nM
Citation
 Jorand-Lebrun, CJones, RWon, ACNguyen, NJohnson, TLDeselm, LCPanda, K Heteroaryl compounds as IRAK inhibitors and uses thereof US Patent  US9790221 Publication Date 10/17/2017 
Target
Name:
Interleukin-1 receptor-associated kinase 4
Synonyms:
IRAK-4 IRAK4_HUMAN Interleukin-1 receptor-associated kinase 4 (IRAK4) | Renal carcinoma antigen NY-REN-64
Type:
Protein
Mol. Mass.:
51519.08
Organism:
Homo sapiens (Human)
Description:
Q9NWZ3
Residue:
460
  
Inhibitor
Name:
BDBM348008
Synonyms:
US9790221, Compound 216
Type:
Small organic molecule
Emp. Form.:
C20H18F3N7OS
Mol. Mass.:
461.463
SMILES:
Cc1nnc(s1)-c1cnc(nc1NCC(O)C(F)(F)F)-c1cccc(c1)-c1cnn(C)c1
: