Target
Phosphatidylinositol 4,5-bisphosphate 3-kinase catalytic subunit delta isoform
Ligand
BDBM348265
Substrate
Meas. Tech.
Inhibition Assay
IC50
<100±n/a nM
Citation
 Ren, PLiu, YLi, LChan, KWilson, TE Heterocyclic kinase inhibitors US Patent  US9790228 Publication Date 10/17/2017 
Target
Name:
Phosphatidylinositol 4,5-bisphosphate 3-kinase catalytic subunit delta isoform
Synonyms:
PI3-kinase p110 subunit delta PI3-kinase subunit p110-delta PIK3CD Phosphatidylinositol 4,5-biphosphate 3-kinase catalytic subunit delta (PIK3CD) Phosphatidylinositol 4,5-bisphosphate 3-kinase 110 kDa catalytic subunit delta (PI3K delta) Phosphatidylinositol 4,5-bisphosphate 3-kinase catalytic subunit delta (PI3Kdelta) Phosphatidylinositol 4,5-bisphosphate 3-kinase catalytic subunit delta isoform (PI3K delta) Phosphatidylinositol 4,5-bisphosphate 3-kinase catalytic subunit delta isoform (PI3K-delta) Phosphatidylinositol 4,5-bisphosphate 3-kinase catalytic subunit delta isoform (PI3Kdelta)
Type:
Enzyme Subunit
Mol. Mass.:
119489.41
Organism:
Homo sapiens (Human)
Description:
O00329
Residue:
1044
  
Inhibitor
Name:
BDBM348265
Synonyms:
US9790228, Compound 184
Type:
Small organic molecule
Emp. Form.:
C26H26N10
Mol. Mass.:
478.5516
SMILES:
CC(C)N(C)c1nc2ccccc2cc1Cn1nc(-c2ccc3nc(N)[nH]c3c2)c2c(N)ncnc12
: