Target
Trace amine-associated receptor 1
Ligand
BDBM348687
Substrate
Meas. Tech.
Radioligand Binding Assay
IC50
4.40±n/a nM
Citation
 Cecere, GGalley, GHu, YNorcross, RPflieger, PShen, H 2-oxa-5-azabicyclo[2.2.1]heptan-3-yl derivatives US Patent  US9790230 Publication Date 10/17/2017 
Target
Name:
Trace amine-associated receptor 1
Synonyms:
TAAR1_MOUSE Taar1 Trace amine receptor 1 (TARR1) Trace amine-associated receptor1 | Trar1
Type:
Protein
Mol. Mass.:
37635.41
Organism:
Mus musculus (Mouse)
Description:
Q923Y8
Residue:
332
  
Inhibitor
Name:
BDBM348687
Synonyms:
4-Chloro-N-[4-[(1S,3R,4S)-2-oxa-5-azabicyclo[2.2.1]heptan-3-yl]phenyl]-3-propyl-1H-pyrazole-5-carboxamide | US9790230, Example 49
Type:
Small organic molecule
Emp. Form.:
C18H23ClN4O2
Mol. Mass.:
362.854
SMILES:
CCCC(=N)C(\Cl)=C(/N)C(=O)Nc1ccc(cc1)[C@H]1O[C@@H]2CN[C@H]1C2
: