Target
Amine oxidase [flavin-containing] B
Ligand
BDBM15606
Substrate
BDBM10990
Meas. Tech.
MAO Activity Assay
Ki
7000±n/a nM
Citation
 La Regina, GSilvestri, RArtico, MLavecchia, ANovellino, EBefani, OTurini, PAgostinelli, E New pyrrole inhibitors of monoamine oxidase: synthesis, biological evaluation, and structural determinants of MAO-A and MAO-B selectivity. J Med Chem 50:922-31 (2007)  
Target
Name:
Amine oxidase [flavin-containing] B
Synonyms:
AOFB_BOVIN MAO-B Monoamine Oxidase Type B (MAO-B) Monoamine oxidase B | Monoamine oxidase type B
Type:
PROTEIN
Mol. Mass.:
58428.94
Organism:
Bos taurus
Description:
ChEMBL_1501478
Residue:
520
  
Inhibitor
Name:
BDBM15606
Synonyms:
(R)-N-(alpha-Cyclohexylethyl)-N-methyl,N-(pyrrol-2-ylmethyl)-amide pyrrole inhibitor 31
Type:
Small organic molecule
Emp. Form.:
C14H24N2
Mol. Mass.:
220.3538
SMILES:
C[C@H](C1CCCCC1)N(C)Cc1ccc[nH]1
:
Substrate
Name:
BDBM10990
Synonyms:
3-amino-1-(2-aminophenyl)propan-1-one Kynuramine
Type:
Small organic molecule
Emp. Form.:
C9H12N2O
Mol. Mass.:
164.2044
SMILES:
NCCC(=O)c1ccccc1N
: