Target
Amine oxidase [flavin-containing] B
Ligand
BDBM15613
Substrate
BDBM10990
Meas. Tech.
MAO Activity Assay
Ki
>100000±n/a nM
Citation
 La Regina, GSilvestri, RArtico, MLavecchia, ANovellino, EBefani, OTurini, PAgostinelli, E New pyrrole inhibitors of monoamine oxidase: synthesis, biological evaluation, and structural determinants of MAO-A and MAO-B selectivity. J Med Chem 50:922-31 (2007)  
Target
Name:
Amine oxidase [flavin-containing] B
Synonyms:
AOFB_BOVIN MAO-B Monoamine Oxidase Type B (MAO-B) Monoamine oxidase B | Monoamine oxidase type B
Type:
PROTEIN
Mol. Mass.:
58428.94
Organism:
Bos taurus
Description:
ChEMBL_1501478
Residue:
520
  
Inhibitor
Name:
BDBM15613
Synonyms:
4-chloro-N-(2-morpholin-4-ylethyl)benzamide Aurorix MCL | Moclobemide
Type:
Small organic molecule
Emp. Form.:
C13H17ClN2O2
Mol. Mass.:
268.739
SMILES:
Clc1ccc(cc1)C(=O)NCCN1CCOCC1
:
Substrate
Name:
BDBM10990
Synonyms:
3-amino-1-(2-aminophenyl)propan-1-one Kynuramine
Type:
Small organic molecule
Emp. Form.:
C9H12N2O
Mol. Mass.:
164.2044
SMILES:
NCCC(=O)c1ccccc1N
: