Target
MAP kinase-activated protein kinase 2
Ligand
BDBM348757
Substrate
Meas. Tech.
Mass Spectrometry Assay
IC50
<100±n/a nM
Citation
 Alexander, MDChuaqui, CMalona, JMcDonald, JJNi, YNiu, DPetter, RCSingh, JPabba, C MK2 inhibitors and uses thereof US Patent  US9790235 Publication Date 10/17/2017 
Target
Name:
MAP kinase-activated protein kinase 2
Synonyms:
MAP kinase-activated protein kinase 2 (MAPKAPK2) MAP kinase-activated protein kinase 2 (p38/MK2) MAPK-activated protein kinase 2 MAPKAP kinase 2 MAPKAPK2 | MK2
Type:
Serine/threonine-protein kinase
Mol. Mass.:
45579.87
Organism:
Homo sapiens (Human)
Description:
P49137
Residue:
400
  
Inhibitor
Name:
BDBM348757
Synonyms:
US9790235, Number I-10
Type:
Small organic molecule
Emp. Form.:
C23H24ClN9OS
Mol. Mass.:
510.014
SMILES:
C[C@@H]1CNc2c(sc3ccc4nc(Nc5nc(Cl)nc(n5)N5CCN(C)CC5)ccc4c23)C(=O)N1
: