Target
Mitogen-activated protein kinase 10
Ligand
BDBM15616
Substrate
EGF receptor peptide
Meas. Tech.
Enzyme Inhibition Assay
Ki
1800±n/a nM
Citation
 Aronov, AMBaker, CBemis, GWCao, JChen, GFord, PJGermann, UAGreen, JHale, MRJacobs, MJanetka, JWMaltais, FMartinez-Botella, GNamchuk, MNStraub, JTang, QXie, X Flipped out: structure-guided design of selective pyrazolylpyrrole ERK inhibitors. J Med Chem 50:1280-7 (2007)  
Target
Name:
Mitogen-activated protein kinase 10
Synonyms:
JNK3 MAP kinase p49 3F12 MK10_HUMAN Mitogen-activated protein kinase 10 (Stress-activated protein kinase JNK3) (c-Jun N-terminal kinase 3) (MAP kinase p49 3F12) PRKM10 Stress-activated protein kinase JNK3 | c-Jun N-terminal kinase 3 (JNK3)
Type:
Enzyme
Mol. Mass.:
52586.89
Organism:
Homo sapiens (Human)
Description:
Residue:
464
  
Inhibitor
Name:
BDBM15616
Synonyms:
4-(3-chlorophenyl)-3-[5-(pyrrolidin-1-ylcarbonyl)-1H-pyrrol-3-yl]-1H-pyrazole Pyrrole Carboxamide Analog 5b
Type:
Small organic molecule
Emp. Form.:
C18H17ClN4O
Mol. Mass.:
340.807
SMILES:
Clc1cccc(c1)-c1c[nH]nc1-c1c[nH]c(c1)C(=O)N1CCCC1
:
Substrate
Name:
EGF receptor peptide
Synonyms:
Epidermal Growth Factor Receptor Peptide (EGFRP)
Type:
Peptide
Mol. Mass.:
2318.63
Organism:
Description:
Residue:
21