Target
Mitogen-activated protein kinase 10
Ligand
BDBM15626
Substrate
EGF receptor peptide
Meas. Tech.
Enzyme Inhibition Assay
Ki
840±n/a nM
Citation
 Aronov, AMBaker, CBemis, GWCao, JChen, GFord, PJGermann, UAGreen, JHale, MRJacobs, MJanetka, JWMaltais, FMartinez-Botella, GNamchuk, MNStraub, JTang, QXie, X Flipped out: structure-guided design of selective pyrazolylpyrrole ERK inhibitors. J Med Chem 50:1280-7 (2007)  
Target
Name:
Mitogen-activated protein kinase 10
Synonyms:
JNK3 MAP kinase p49 3F12 MK10_HUMAN Mitogen-activated protein kinase 10 (Stress-activated protein kinase JNK3) (c-Jun N-terminal kinase 3) (MAP kinase p49 3F12) PRKM10 Stress-activated protein kinase JNK3 | c-Jun N-terminal kinase 3 (JNK3)
Type:
Enzyme
Mol. Mass.:
52586.89
Organism:
Homo sapiens (Human)
Description:
Residue:
464
  
Inhibitor
Name:
BDBM15626
Synonyms:
4-[4-(3-chlorophenyl)-1H-pyrazol-3-yl]-N-[(4-methoxyphenyl)methyl]-1H-pyrrole-2-carboxamide Pyrrole Carboxamide Analog 5l
Type:
Small organic molecule
Emp. Form.:
C22H19ClN4O2
Mol. Mass.:
406.865
SMILES:
COc1ccc(CNC(=O)c2cc(c[nH]2)-c2n[nH]cc2-c2cccc(Cl)c2)cc1
:
Substrate
Name:
EGF receptor peptide
Synonyms:
Epidermal Growth Factor Receptor Peptide (EGFRP)
Type:
Peptide
Mol. Mass.:
2318.63
Organism:
Description:
Residue:
21