Target
Sentrin-specific protease 7
Ligand
BDBM348888
Substrate
Meas. Tech.
Binding Assay
IC50
4700±1700 nM
Citation
 Chen, Y Methods of identifying SENP1 inhibitors US Patent  US9791447 Publication Date 10/17/2017 
Target
Name:
Sentrin-specific protease 7
Synonyms:
KIAA1707 SENP7_HUMAN SUSP2 | Sentrin-specific protease 7 (SENP7)
Type:
Protein
Mol. Mass.:
119657.39
Organism:
Homo sapiens (Human)
Description:
Q9BQF6
Residue:
1050
  
Inhibitor
Name:
BDBM348888
Synonyms:
NSC70551 US9791447, Compound SPI-06
Type:
Small organic molecule
Emp. Form.:
C17H14N3O3S
Mol. Mass.:
340.377
SMILES:
Cc1ccccc1\N=N\c1cc(c2ccccc2c1N)S([O-])(=O)=O
: