Target
Lysine-specific histone demethylase 1A
Ligand
BDBM342173
Substrate
Meas. Tech.
In Vitro Enzyme Inhibition Assay LSD-1
IC50
<100±n/a nM
Citation
 Chen, YKKanouni, TKaldor, SWStafford, JAVeal, JM Inhibitors of lysine specific demethylase-1 US Patent  US10207999 Publication Date 2/19/2019 
Target
Name:
Lysine-specific histone demethylase 1A
Synonyms:
AOF2 Flavin-containing amine oxidase domain-containing protein 2 KDM1A KIAA0601 Lysine-specific demethylase 1 (LSD1) Lysine-specific histone demethylase 1 (LSD1)
Type:
Enzyme
Mol. Mass.:
92901.01
Organism:
Homo sapiens (Human)
Description:
O60341
Residue:
852
  
Inhibitor
Name:
BDBM342173
Synonyms:
4-[2-(4-amino-piperidin-1-yl)-5- (1H-indol-5-yl)-1-methyl-6-oxo-1,6- dihydro-pyrimidin-4-yl]-2-fluoro- benzonitrile US10328077, Example 73 US10849898, Example 73 US11084793, Example 73 US9776974, Example 73
Type:
Small organic molecule
Emp. Form.:
C25H23FN6O
Mol. Mass.:
442.4881
SMILES:
Cn1c(nc(-c2ccc(C#N)c(F)c2)c(-c2ccc3[nH]ccc3c2)c1=O)N1CCC(N)CC1
: