Target
Lysine-specific histone demethylase 1A
Ligand
BDBM342195
Substrate
Meas. Tech.
In Vitro Enzyme Inhibition Assay LSD-1
IC50
<100±n/a nM
Citation
 Chen, YKKanouni, TKaldor, SWStafford, JAVeal, JM Inhibitors of lysine specific demethylase-1 US Patent  US10207999 Publication Date 2/19/2019 
Target
Name:
Lysine-specific histone demethylase 1A
Synonyms:
AOF2 Flavin-containing amine oxidase domain-containing protein 2 KDM1A KIAA0601 Lysine-specific demethylase 1 (LSD1) Lysine-specific histone demethylase 1 (LSD1)
Type:
Enzyme
Mol. Mass.:
92901.01
Organism:
Homo sapiens (Human)
Description:
O60341
Residue:
852
  
Inhibitor
Name:
BDBM342195
Synonyms:
4-[2-(4-aminopiperidin-1-yl)-5- (4-ethoxyphenyl)-1-methyl-6- oxopyrimidin-4-yl]-2- fluorobenzonitrile US10328077, Example 95 US10849898, Example 95 US11084793, Example 95 US9776974, Example 95
Type:
Small organic molecule
Emp. Form.:
C25H26FN5O2
Mol. Mass.:
447.5046
SMILES:
CCOc1ccc(cc1)-c1c(nc(N2CCC(N)CC2)n(C)c1=O)-c1ccc(C#N)c(F)c1
: