Target
G-protein coupled estrogen receptor 1
Ligand
BDBM349606
Substrate
Meas. Tech.
Estrogen Receptor (ER) Degradation Assay
IC50
<1000±n/a nM
Citation
 Strum, JC Benzothiophene estrogen receptor modulators US Patent  US10208011 Publication Date 2/19/2019 
Target
Name:
G-protein coupled estrogen receptor 1
Synonyms:
CEPR DRY12 G-protein-coupled receptor (GPR30 ) GPER1 GPR30
Type:
PROTEIN
Mol. Mass.:
42259.21
Organism:
Homo sapiens (Human)
Description:
ChEMBL_982507
Residue:
375
  
Inhibitor
Name:
BDBM349606
Synonyms:
(3-(4-(2-(ethylamino)ethyl)phenoxy)-6- hydroxybenzo[b]thiophen-2-yl)(4-fluoro- 2,6-dimethylphenyl)methanone US10981887, Compound 100
Type:
Small organic molecule
Emp. Form.:
C27H26FNO3S
Mol. Mass.:
463.564
SMILES:
CCNCCc1ccc(Oc2c(sc3cc(O)ccc23)C(=O)c2c(C)cc(F)cc2C)cc1
: