Target
G-protein coupled estrogen receptor 1
Ligand
BDBM349621
Substrate
Meas. Tech.
Human ERalpha Reporter Assa
IC50
<1000±n/a nM
Citation
 Strum, JC Benzothiophene estrogen receptor modulators US Patent  US10208011 Publication Date 2/19/2019 
Target
Name:
G-protein coupled estrogen receptor 1
Synonyms:
CEPR DRY12 G-protein-coupled receptor (GPR30 ) GPER1 GPR30
Type:
PROTEIN
Mol. Mass.:
42259.21
Organism:
Homo sapiens (Human)
Description:
ChEMBL_982507
Residue:
375
  
Inhibitor
Name:
BDBM349621
Synonyms:
(3-(4-(aminomethyl)phenoxy)-6- hydroxybenzo[b]thiophen-2-yl)(4-fluoro- 2,6-dimethylphenyl)methanone US10981887, Compound 115
Type:
Small organic molecule
Emp. Form.:
C24H20FNO3S
Mol. Mass.:
421.484
SMILES:
Cc1cc(F)cc(C)c1C(=O)c1sc2cc(O)ccc2c1Oc1ccc(CN)cc1
: