Target
Glucagon-like peptide 1 receptor
Ligand
BDBM349785
Substrate
Meas. Tech.
CHO GLP-1R Clone H6-Assay 1
EC50
1.20±n/a nM
Citation
 Aspnes, GEBagley, SWCurto, JMDowling, MSEdmonds, DFlanagan, MEFutatsugi, KGriffith, DAHuard, KIngle, GJiao, WLimberakis, CMathiowetz, AMPiotrowski, DWRuggeri, RB GLP-1 receptor agonists and uses thereof US Patent  US10208019 Publication Date 2/19/2019 
Target
Name:
Glucagon-like peptide 1 receptor
Synonyms:
GLP-1 receptor GLP-1R GLP1R_HUMAN Glucagon-like peptide 1 receptor (GLP-1)
Type:
Enzyme
Mol. Mass.:
53035.78
Organism:
Homo sapiens (Human)
Description:
P43220
Residue:
463
  
Inhibitor
Name:
BDBM349785
Synonyms:
2-[(4-{6-[(4-cyanobenzyl)oxy]-5-fluoropyridin-2-yl}piperidin-1-yl)methyl]-1-[(2S)-oxetan-2-ylmethyl]-1H-benzimidazole-6-carboxylic acid | US10208019, Example 10A-55
Type:
Small organic molecule
Emp. Form.:
C31H30FN5O4
Mol. Mass.:
555.5994
SMILES:
OC(=O)c1ccc2nc(CN3CCC(CC3)c3ccc(F)c(OCc4ccc(cc4)C#N)n3)n(C[C@@H]3CCO3)c2c1
: