Target
Acidic mammalian chitinase
Ligand
BDBM349911
Substrate
Meas. Tech.
Human AMCase Activity Assay
IC50
<100±n/a nM
Citation
 Mazur, MKoralewski, RBorek, BOlejniczak, SCzestkowski, WJPiotrowicz, MCOlczak, JPGolebiowski, AABartoszewicz, AMaziarz, EKowalski, M Substituted amino triazoles useful as human chitinase inhibitors US Patent  US10208020 Publication Date 2/19/2019 
Target
Name:
Acidic mammalian chitinase
Synonyms:
AMCase CHIA Lung-specific protein TSA1902
Type:
Protein
Mol. Mass.:
52266.66
Organism:
Homo sapiens (Human)
Description:
Q9BZP6
Residue:
476
  
Inhibitor
Name:
BDBM349911
Synonyms:
(S)-5-(4-(3-(4- chlorobenzyl)morpholino) piperidin-1-yl)-4H-1,2,4- triazol-3-amine US10208020, Example 2 US9944624, Ex. 2
Type:
Small organic molecule
Emp. Form.:
C18H25ClN6O
Mol. Mass.:
376.884
SMILES:
Nc1nnc([nH]1)N1CCC(CC1)N1CCOCC1Cc1ccc(Cl)cc1
: