Target
Acidic mammalian chitinase
Ligand
BDBM349967
Substrate
Meas. Tech.
Human AMCase Activity Assay
IC50
<100±n/a nM
Citation
 Mazur, MKoralewski, RBorek, BOlejniczak, SCzestkowski, WJPiotrowicz, MCOlczak, JPGolebiowski, AABartoszewicz, AMaziarz, EKowalski, M Substituted amino triazoles useful as human chitinase inhibitors US Patent  US10208020 Publication Date 2/19/2019 
Target
Name:
Acidic mammalian chitinase
Synonyms:
AMCase CHIA Lung-specific protein TSA1902
Type:
Protein
Mol. Mass.:
52266.66
Organism:
Homo sapiens (Human)
Description:
Q9BZP6
Residue:
476
  
Inhibitor
Name:
BDBM349967
Synonyms:
(S)-5-(4-(3-(4-chlorobenzyl)-1-methyl-2,3-dihydro-1H-benzo[e][1,4]diazepin-4(5H)-yl)piperidin-1-yl)-4H-1,2,4-triazol-3-amine US10538508, Example 57 US9944624, Ex. 57
Type:
Small organic molecule
Emp. Form.:
C24H30ClN7
Mol. Mass.:
451.995
SMILES:
CN1C[C@H](Cc2ccc(Cl)cc2)N(Cc2ccccc12)C1CCN(CC1)c1nnc(N)[nH]1
: