Target
Chitotriosidase-1
Ligand
BDBM349971
Substrate
Meas. Tech.
Human CHIT1 Activity Assay
IC50
5500±n/a nM
Citation
 Mazur, MKoralewski, RBorek, BOlejniczak, SCzestkowski, WJPiotrowicz, MCOlczak, JPGolebiowski, AABartoszewicz, AMaziarz, EKowalski, M Substituted amino triazoles useful as human chitinase inhibitors US Patent  US10208020 Publication Date 2/19/2019 
Target
Name:
Chitotriosidase-1
Synonyms:
CHIT1 Chitinase 1 Chitotriosidase Chitotriosidase-1 (CHIT1)
Type:
Enzyme
Mol. Mass.:
51682.25
Organism:
Homo sapiens (Human)
Description:
Q13231
Residue:
466
  
Inhibitor
Name:
BDBM349971
Synonyms:
(S)-5-(4-(7-chloro-3-(4-chlorobenzyl)-2,3-dihydrobenzo[f][1,4]oxazepin-4(5H)-yl)piperidin-1-yl)-4H-1,2,4-triazol-3-amine US10538508, Example 61 US9944624, Ex. 61
Type:
Small organic molecule
Emp. Form.:
C23H26Cl2N6O
Mol. Mass.:
473.398
SMILES:
Nc1nnc([nH]1)N1CCC(CC1)N1Cc2cc(Cl)ccc2OC[C@@H]1Cc1ccc(Cl)cc1
: