Target
Coagulation factor XI
Ligand
BDBM349984
Substrate
Meas. Tech.
In Vitro Factor XIa Assay
Ki
<5±n/a nM
Citation
 Orwat, MJPinto, DJSmith, II, LMSrivastava, S Substituted tetrahydroisoquinoline compounds as factor XIa inhibitors US Patent  US10208021 Publication Date 2/19/2019 
Target
Name:
Coagulation factor XI
Synonyms:
Coagulation factor XIa Coagulation factor XIa light chain FA11_HUMAN Factor XIa PTA | Plasma thromboplastin antecedent
Type:
Enzyme
Mol. Mass.:
70130.58
Organism:
Homo sapiens (Human)
Description:
P03951
Residue:
625
  
Inhibitor
Name:
BDBM349984
Synonyms:
(E)-4-(2-(3-(3-Chloro-2-fluoro-6-(1H-tetrazol-1-yl)phenyl)acryloyl)-5-(4-(pyrrolidin-1-yl)piperidin-1-yl)-1,2,3,4-tetrahydroisoquinoline-1-carboxamido)benzoic acid, bis TFA Salt | US10208021, Example 80
Type:
Small organic molecule
Emp. Form.:
C36H36ClFN8O4
Mol. Mass.:
699.174
SMILES:
OC(=O)c1ccc(NC(=O)C2N(CCc3c2cccc3N2CCC(CC2)N2CCCC2)C(=O)\C=C\c2c(F)c(Cl)ccc2-n2cnnn2)cc1
: