Target
Tyrosine-protein phosphatase non-receptor type 1 [1-298]
Ligand
BDBM15816
Substrate
BDBM13466
Meas. Tech.
PTP1B and TCPTP Inhibition Assay
pH
7.5±n/a
Temperature
295.15±n/a K
Ki
710±280 nM
Citation
 Xin, ZOost, TKAbad-Zapatero, CHajduk, PJPei, ZSzczepankiewicz, BGHutchins, CWBallaron, SJStashko, MALubben, TTrevillyan, JMJirousek, MRLiu, G Potent, selective inhibitors of protein tyrosine phosphatase 1B. Bioorg Med Chem Lett 13:1887-90 (2003)  
Target
Name:
Tyrosine-protein phosphatase non-receptor type 1 [1-298]
Synonyms:
PTN1_HUMAN PTP1B PTPase 1B Tyrosine-protein phosphatase, non-receptor type 1
Type:
Enzyme
Mol. Mass.:
34670.65
Organism:
Homo sapiens (Human)
Description:
The catalytic domain of PTP 1B (residues 1-298) was expressed and purified from E. coli.
Residue:
298
  
Inhibitor
Name:
BDBM15816
Synonyms:
1:1 mixture of diastereomers oxalyl-aryl-amino benzoic acid-based inhibitor 16
Type:
Small organic molecule
Emp. Form.:
C33H43N5O10
Mol. Mass.:
669.722
SMILES:
CCc1cc(CC(NC(C)=O)C(=O)NCCCCC(=O)N[C@@H](CCCCN)C(O)=O)ccc1N(C(=O)C(O)=O)c1ccccc1C(O)=O
:
Substrate
Name:
BDBM13466
Synonyms:
4-Nitrophenyl phosphate disodium salt hexahydrate disodium (4-nitrophenyl) phosphate | para-nitrophenyl phosphate (pNPP)
Type:
Small organic molecule
Emp. Form.:
C6H4NO6P
Mol. Mass.:
217.0739
SMILES:
[O-][N+](=O)c1ccc(O[P+]([O-])([O-])[O-])cc1
: