Target
Fibroblast growth factor receptor 1
Ligand
BDBM350049
Substrate
Meas. Tech.
Enzyme Assay
IC50
3.10±n/a nM
Citation
 Andrews, SWBlake, JFCook, AGunawardana, IWHunt, KWMetcalf, ATMoreno, DRen, LTang, TP 2-aryl- and 2-heteroaryl-substituted 2-pyridazin-3(2H)-one compounds as inhibitors of FGFR tyrosine kinases US Patent  US10208024 Publication Date 2/19/2019 
Target
Name:
Fibroblast growth factor receptor 1
Synonyms:
BFGFR Basic fibroblast growth factor receptor 1 (FGFR1) CEK FGFR-1 FGFR-1, (FL) FGFR1_HUMAN FLT2 Fibroblast growth factor receptor 1 (FGFR-1) Fms-like tyrosine kinase 2 N-sam bFGF-R | c-fgr
Type:
Receptor
Mol. Mass.:
91861.70
Organism:
Homo sapiens (Human)
Description:
P11362
Residue:
822
  
Inhibitor
Name:
BDBM350049
Synonyms:
6-(3-amino-6-(1-methyl- 1H-pyrazol-4-yl)pyrazin- 2-yl)-4-cyclopropyl-2- (3,5- dimethoxyphenyl)pyridazin- 3(2H)-one US10766881, Example 48
Type:
Small organic molecule
Emp. Form.:
C23H23N7O3
Mol. Mass.:
445.4738
SMILES:
COc1cc(OC)cc(c1)-n1nc(cc(C2CC2)c1=O)-c1nc(cnc1N)-c1cnn(C)c1
: