Target
Fibroblast growth factor receptor 3
Ligand
BDBM350049
Substrate
Meas. Tech.
Enzyme Assay
IC50
1.40±n/a nM
Citation
 Andrews, SWBlake, JFCook, AGunawardana, IWHunt, KWMetcalf, ATMoreno, DRen, LTang, TP 2-aryl- and 2-heteroaryl-substituted 2-pyridazin-3(2H)-one compounds as inhibitors of FGFR tyrosine kinases US Patent  US10208024 Publication Date 2/19/2019 
Target
Name:
Fibroblast growth factor receptor 3
Synonyms:
CD_antigen: CD333 FGFR3 Fibroblast growth factor receptor JTK4
Type:
Protein
Mol. Mass.:
87699.57
Organism:
Homo sapiens (Human)
Description:
P22607
Residue:
806
  
Inhibitor
Name:
BDBM350049
Synonyms:
6-(3-amino-6-(1-methyl- 1H-pyrazol-4-yl)pyrazin- 2-yl)-4-cyclopropyl-2- (3,5- dimethoxyphenyl)pyridazin- 3(2H)-one US10766881, Example 48
Type:
Small organic molecule
Emp. Form.:
C23H23N7O3
Mol. Mass.:
445.4738
SMILES:
COc1cc(OC)cc(c1)-n1nc(cc(C2CC2)c1=O)-c1nc(cnc1N)-c1cnn(C)c1
: