Target
Mitogen-activated protein kinase 8
Ligand
BDBM15893
Substrate
biotinylated GST-ATF2
Meas. Tech.
ATF-2 Phosphorylation Assay
IC50
>10000±n/a nM
Citation
 Liu, MXin, ZClampit, JEWang, SGum, RJHaasch, DLTrevillyan, JMAbad-Zapatero, CFry, EHSham, HLLiu, G Synthesis and SAR of 1,9-dihydro-9-hydroxypyrazolo[3,4-b]quinolin-4-ones as novel, selective c-Jun N-terminal kinase inhibitors. Bioorg Med Chem Lett 16:2590-4 (2006)  
Target
Name:
Mitogen-activated protein kinase 8
Synonyms:
JNK-46 JNK1-alpha-1 MK08_HUMAN PRKM8 SAPK1C c-Jun N-terminal kinase 1 c-Jun N-terminal kinase 1(JNK1) | c-Jun N-terminal kinase 2 (JNK2)
Type:
Enzyme
Mol. Mass.:
48297.57
Organism:
Homo sapiens (Human)
Description:
JNK-1 was purchased from Upstate Cell Signaling Solutions (formerly Upstate Biotechnology).
Residue:
427
  
Inhibitor
Name:
BDBM15893
Synonyms:
3-{6-chloro-9-hydroxy-1-methyl-4-oxo-1H,4H,9H-pyrazolo[3,4-b]quinolin-3-yl}propanoic acid | 9-hydroxy pyrazoloquinolinone 7i
Type:
Small organic molecule
Emp. Form.:
C14H12ClN3O4
Mol. Mass.:
321.716
SMILES:
Cn1nc(CCC(O)=O)c2c1n(O)c1ccc(Cl)cc1c2=O
:
Substrate
Name:
biotinylated GST-ATF2
Synonyms:
ATF-2-GST Activating transcription factor 2 GST-ATF2 biotinylated activating transcription factor 2
Type:
Other Protein Type
Mol. Mass.:
12237.77
Organism:
Homo sapiens (Human)
Description:
Residue:
109