Target
Mitogen-activated protein kinase 8
Ligand
BDBM15910
Substrate
biotinylated GST-ATF2
Meas. Tech.
ATF-2 Phosphorylation Assay
pH
7.2±n/a
Temperature
293.15±n/a K
IC50
>10000±n/a nM
Citation
 Zhao, HSerby, MDXin, ZSzczepankiewicz, BGLiu, MKosogof, CLiu, BNelson, LTJohnson, EFWang, SPederson, TGum, RJClampit, JEHaasch, DLAbad-Zapatero, CFry, EHRondinone, CTrevillyan, JMSham, HLLiu, G Discovery of potent, highly selective, and orally bioavailable pyridine carboxamide c-Jun NH2-terminal kinase inhibitors. J Med Chem 49:4455-8 (2006)  
Target
Name:
Mitogen-activated protein kinase 8
Synonyms:
JNK-46 JNK1-alpha-1 MK08_HUMAN PRKM8 SAPK1C c-Jun N-terminal kinase 1 c-Jun N-terminal kinase 1(JNK1) | c-Jun N-terminal kinase 2 (JNK2)
Type:
Enzyme
Mol. Mass.:
48297.57
Organism:
Homo sapiens (Human)
Description:
JNK-1 was purchased from Upstate Cell Signaling Solutions (formerly Upstate Biotechnology).
Residue:
427
  
Inhibitor
Name:
BDBM15910
Synonyms:
4-Amino-6-(2,5-dimethoxy-benzylamino)-2-ethoxy-nicotinonitrile aminopyridine deriv. 6
Type:
Small organic molecule
Emp. Form.:
C17H20N4O3
Mol. Mass.:
328.3657
SMILES:
CCOc1nc(NCc2cc(OC)ccc2OC)cc(N)c1C#N
:
Substrate
Name:
biotinylated GST-ATF2
Synonyms:
ATF-2-GST Activating transcription factor 2 GST-ATF2 biotinylated activating transcription factor 2
Type:
Other Protein Type
Mol. Mass.:
12237.77
Organism:
Homo sapiens (Human)
Description:
Residue:
109