Target
Fascin
Ligand
BDBM350100
Substrate
Meas. Tech.
Chemical Library Screens and Analysis
IC50
734±n/a nM
Citation
 Huang, XShue, CY Methods for inhibiting fascin US Patent  US10208043 Publication Date 2/19/2019 
Target
Name:
Fascin
Synonyms:
55 kDa actin-bundling protein FSCN1 HSN Singed-like protein | p55
Type:
Enzyme Catalytic Domain
Mol. Mass.:
54533.89
Organism:
Homo sapiens (human)
Description:
Residue:
493
  
Inhibitor
Name:
BDBM350100
Synonyms:
5-(3,4-dichlorobenzyl)-1- (S,S,-dioxo- tetrahydrothiophen-3-yl)- 1H-pyrazol[3,4- d]pyrimidin-4(5H)-one US10941146, # 1
Type:
Small organic molecule
Emp. Form.:
C16H14Cl2N4O3S
Mol. Mass.:
413.278
SMILES:
Clc1ccc(Cn2cnc3n(ncc3c2=O)C2CCS(=O)(=O)C2)cc1Cl
: