Target
Fascin
Ligand
BDBM350109
Substrate
Meas. Tech.
Chemical Library Screens and Analysis
IC50
807±n/a nM
Citation
 Huang, XShue, CY Methods for inhibiting fascin US Patent  US10208043 Publication Date 2/19/2019 
Target
Name:
Fascin
Synonyms:
55 kDa actin-bundling protein FSCN1 HSN Singed-like protein | p55
Type:
Enzyme Catalytic Domain
Mol. Mass.:
54533.89
Organism:
Homo sapiens (human)
Description:
Residue:
493
  
Inhibitor
Name:
BDBM350109
Synonyms:
N-(3-(1H-1,2,4-triazol-3- ylthio)-4- hydroxynaphthalen-1-yl)- 4-methoxy- benzenesulfonamide US10941146, # 10
Type:
Small organic molecule
Emp. Form.:
C19H16N4O4S2
Mol. Mass.:
428.485
SMILES:
COc1ccc(cc1)S(=O)(=O)Nc1cc(Sc2nc[nH]n2)c(O)c2ccccc12
: