Target
Fascin
Ligand
BDBM350122
Substrate
Meas. Tech.
Chemical Library Screens and Analysis
IC50
4300±n/a nM
Citation
 Huang, XShue, CY Methods for inhibiting fascin US Patent  US10208043 Publication Date 2/19/2019 
Target
Name:
Fascin
Synonyms:
55 kDa actin-bundling protein FSCN1 HSN Singed-like protein | p55
Type:
Enzyme Catalytic Domain
Mol. Mass.:
54533.89
Organism:
Homo sapiens (human)
Description:
Residue:
493
  
Inhibitor
Name:
BDBM350122
Synonyms:
N-(4-fluorobenzyl)-2-(4- oxo-1-(S,S-dioxo- tetrahydrothiophen-3-yl)- 1H-pyrazolo[3,4- d]pyrimidin-5(4H)- yl)acetamide US10941146, # 24
Type:
Small organic molecule
Emp. Form.:
C18H18FN5O4S
Mol. Mass.:
419.43
SMILES:
Fc1ccc(CNC(=O)Cn2cnc3n(ncc3c2=O)C2CCS(=O)(=O)C2)cc1
: