Target
Tyrosine-protein kinase BTK
Ligand
BDBM350158
Substrate
Meas. Tech.
Btk Enzyme Activity Assay
IC50
33.5±n/a nM
Citation
 Liu, JKozlowski, JAAndresen, BMBoga, SBGao, XGuiadeen, DGCai, JLiu, SWang, DWu, HYang, C Tertiary alcohol imidazopyrazine BTK inhibitors US Patent  US10208047 Publication Date 2/19/2019 
Target
Name:
Tyrosine-protein kinase BTK
Synonyms:
AGMX1 Agammaglobulinaemia tyrosine kinase B cell progenitor kinase BPK BTK_HUMAN Tyrosine Kinase BTK Tyrosine-protein kinase BTK (BTK)
Type:
Enzyme
Mol. Mass.:
76289.95
Organism:
Homo sapiens (Human)
Description:
Q06187
Residue:
659
  
Inhibitor
Name:
BDBM350158
Synonyms:
(3-exo,8-syn)-3-[8-amino-1- (4-{(1R)-1-hydroxy-1-[3- (trifluoromethyl)phenyl] ethyl}phenyl)imidazo[1,5- a]pyrazin-3- yl]bicyclo[3.2.1]octane-8- carboxylic acid | US10208047, Example 26
Type:
Small organic molecule
Emp. Form.:
C30H29F3N4O3
Mol. Mass.:
550.5715
SMILES:
C[C@@](O)(c1ccc(cc1)-c1nc([C@H]2C[C@@H]3CC[C@H](C2)[C@@H]3C(O)=O)n2ccnc(N)c12)c1cccc(c1)C(F)(F)F
: