Target
Cyclin-C/Cyclin-dependent kinase 8
Ligand
BDBM350173
Substrate
Meas. Tech.
CDK8/Cyclin C Binding Assay
IC50
1870±n/a nM
Citation
 Pastor Fernández, JMartínez González, SBlanco-Aparicio, CHernández Higueras, AIGómez De La Oliva, CARivero Buceta, VRiesco Fagundo, RC Condensed tricyclic compounds as protein kinase inhibitors US Patent  US10208056 Publication Date 2/19/2019 
Target
Name:
Cyclin-C/Cyclin-dependent kinase 8
Synonyms:
CDK8/Cyclin C
Type:
Mol. Mass.:
Description:
ASSAY_ID of ChEMBL is 1562017
Components:
This complex has 2 components.
Component 1
Name:
Cyclin-dependent kinase 8
Synonyms:
CDK8 Cell division protein kinase 8 Mediator complex subunit CDK8 Protein kinase K35
Type:
Serine/threonine-protein kinase
Mol. Mass.:
53300.21
Organism:
Homo sapiens (Human)
Description:
P49336
Residue:
464
  
Component 2
Name:
Cyclin-C
Synonyms:
CCNC Cyclin C hSRB11
Type:
PROTEIN
Mol. Mass.:
33244.88
Organism:
Homo sapiens (Human)
Description:
ChEMBL_107900
Residue:
283
  
Inhibitor
Name:
BDBM350173
Synonyms:
US10208056, Compound 5
Type:
Small organic molecule
Emp. Form.:
C23H30N4O4
Mol. Mass.:
426.5087
SMILES:
CC(C)(C)OC(=O)N1CCC(CC1)NC(=O)c1cc2c([nH]1)-c1ccncc1OC2(C)C
: