Target
Cyclin-C/Cyclin-dependent kinase 8
Ligand
BDBM350192
Substrate
Meas. Tech.
CDK8/Cyclin C Binding Assay
IC50
10000±n/a nM
Citation
 Pastor Fernández, JMartínez González, SBlanco-Aparicio, CHernández Higueras, AIGómez De La Oliva, CARivero Buceta, VRiesco Fagundo, RC Condensed tricyclic compounds as protein kinase inhibitors US Patent  US10208056 Publication Date 2/19/2019 
Target
Name:
Cyclin-C/Cyclin-dependent kinase 8
Synonyms:
CDK8/Cyclin C
Type:
Mol. Mass.:
Description:
ASSAY_ID of ChEMBL is 1562017
Components:
This complex has 2 components.
Component 1
Name:
Cyclin-dependent kinase 8
Synonyms:
CDK8 Cell division protein kinase 8 Mediator complex subunit CDK8 Protein kinase K35
Type:
Serine/threonine-protein kinase
Mol. Mass.:
53300.21
Organism:
Homo sapiens (Human)
Description:
P49336
Residue:
464
  
Component 2
Name:
Cyclin-C
Synonyms:
CCNC Cyclin C hSRB11
Type:
PROTEIN
Mol. Mass.:
33244.88
Organism:
Homo sapiens (Human)
Description:
ChEMBL_107900
Residue:
283
  
Inhibitor
Name:
BDBM350192
Synonyms:
US10208056, Compound 24
Type:
Small organic molecule
Emp. Form.:
C20H18N2O3
Mol. Mass.:
334.3685
SMILES:
CC1(C)Oc2cnccc2-c2c1cc(C(O)=O)n2Cc1ccccc1
: