Target
Cyclin-C/Cyclin-dependent kinase 8
Ligand
BDBM350210
Substrate
Meas. Tech.
CDK8/Cyclin C Binding Assay
IC50
197±n/a nM
Citation
 Pastor Fernández, JMartínez González, SBlanco-Aparicio, CHernández Higueras, AIGómez De La Oliva, CARivero Buceta, VRiesco Fagundo, RC Condensed tricyclic compounds as protein kinase inhibitors US Patent  US10208056 Publication Date 2/19/2019 
Target
Name:
Cyclin-C/Cyclin-dependent kinase 8
Synonyms:
CDK8/Cyclin C
Type:
Mol. Mass.:
Description:
ASSAY_ID of ChEMBL is 1562017
Components:
This complex has 2 components.
Component 1
Name:
Cyclin-dependent kinase 8
Synonyms:
CDK8 Cell division protein kinase 8 Mediator complex subunit CDK8 Protein kinase K35
Type:
Serine/threonine-protein kinase
Mol. Mass.:
53300.21
Organism:
Homo sapiens (Human)
Description:
P49336
Residue:
464
  
Component 2
Name:
Cyclin-C
Synonyms:
CCNC Cyclin C hSRB11
Type:
PROTEIN
Mol. Mass.:
33244.88
Organism:
Homo sapiens (Human)
Description:
ChEMBL_107900
Residue:
283
  
Inhibitor
Name:
BDBM350210
Synonyms:
US10208056, Compound 42
Type:
Small organic molecule
Emp. Form.:
C17H20N4O2
Mol. Mass.:
312.3663
SMILES:
CCN1CCC2(CC1)Oc1cnccc1-c1[nH]c(cc21)C(N)=O
: