Target
P2X purinoceptor 7
Ligand
BDBM160087
Substrate
Meas. Tech.
Ca2+ flux assay
pH
7.4±n/a
IC50
6.90±n/a nM
Comments
extracted
Citation
 Ameriks, MKRech, JCSavall, BM Substituted [1,2,4]triazolo[4,3-a]pyrazines as P2X7 modulators US Patent  US10047092 Publication Date 8/14/2018 
Target
Name:
P2X purinoceptor 7
Synonyms:
ATP receptor P2X purinoceptor 7 P2X purinoceptor 7 (P2X7) P2X7 rat P2rx7 | Purinergic receptor
Type:
Protein
Mol. Mass.:
68403.50
Organism:
Rattus norvegicus (Rat)
Description:
Q64663
Residue:
595
  
Inhibitor
Name:
BDBM160087
Synonyms:
US10047092, 28 US9040534, 28
Type:
Small organic molecule
Emp. Form.:
C17H14ClF3N6O
Mol. Mass.:
410.781
SMILES:
C[C@H]1Cn2c(nnc2C(=O)N1Cc1cccc(c1Cl)C(F)(F)F)-c1cc[nH]n1
: