Target
P2X purinoceptor 7
Ligand
BDBM160099
Substrate
Meas. Tech.
Ca2+ flux assay
pH
7.4±n/a
IC50
1303±n/a nM
Comments
extracted
Citation
 Ameriks, MKRech, JCSavall, BM Substituted [1,2,4]triazolo[4,3-a]pyrazines as P2X7 modulators US Patent  US10047092 Publication Date 8/14/2018 
Target
Name:
P2X purinoceptor 7
Synonyms:
ATP receptor P2X purinoceptor 7 P2X purinoceptor 7 (P2X7) P2X7 rat P2rx7 | Purinergic receptor
Type:
Protein
Mol. Mass.:
68403.50
Organism:
Rattus norvegicus (Rat)
Description:
Q64663
Residue:
595
  
Inhibitor
Name:
BDBM160099
Synonyms:
US10047092, 40 US9040534, 40
Type:
Small organic molecule
Emp. Form.:
C18H15ClF3N5OS
Mol. Mass.:
441.858
SMILES:
C[C@H]1Cn2c(nnc2C(=O)N1Cc1cccc(c1Cl)C(F)(F)F)-c1scnc1C
: