Target
ATP-sensitive inward rectifier potassium channel 1
Ligand
BDBM350307
Substrate
Meas. Tech.
Thallium Flux Assay
IC50
82.0±n/a nM
Citation
 Pasternak, ADavies, IDing, FJiang, JDong, SGu, XSuzuki, TVacca, JPPu, ZXu, S Inhibitors of the renal outer medullary potassium channel US Patent  US10208064 Publication Date 2/19/2019 
Target
Name:
ATP-sensitive inward rectifier potassium channel 1
Synonyms:
ATP-regulated potassium channel ROM-K ATP-sensitive inward rectifier potassium channel 1 KCNJ1 Potassium channel (ATP modulatory) ROMK1 The Renal Outer Medullary Potassium (ROMK)
Type:
Enzyme Catalytic Domain
Mol. Mass.:
44809.08
Organism:
Homo sapiens (Human)
Description:
gi_223460826
Residue:
391
  
Inhibitor
Name:
BDBM350307
Synonyms:
US10208064, Example 26
Type:
Small organic molecule
Emp. Form.:
C26H30N6O4
Mol. Mass.:
490.5542
SMILES:
CC1=C(COC1=O)N1CCC2(CCN(C[C@@H](O)c3cc4Cn5nnnc5-c4cc3C3CC3)CC2)C1=O
: