Target
Phosphatidylinositol 3-kinase regulatory subunit beta
Ligand
BDBM350445
Substrate
Meas. Tech.
Transcreener KINASE Assay
IC50
3584±n/a nM
Citation
 Su, WDai, GZhang, WDeng, W Imidazopyridazine compounds and their use US Patent  US10208066 Publication Date 2/19/2019 
Target
Name:
Phosphatidylinositol 3-kinase regulatory subunit beta
Synonyms:
P85B_HUMAN PI3-kinase subunit p85-beta PIK3R2 PtdIns-3-kinase regulatory subunit beta | PtdIns-3-kinase regulatory subunit p85-beta
Type:
Enzyme Subunit
Mol. Mass.:
81542.75
Organism:
Homo sapiens (Human)
Description:
O00459
Residue:
728
  
Inhibitor
Name:
BDBM350445
Synonyms:
US10208066, Compound 67 | US10611777, Compound 67
Type:
Small organic molecule
Emp. Form.:
C20H16ClFN8
Mol. Mass.:
422.846
SMILES:
C[C@H](Nc1ncnc(N)c1C#N)c1cc2ncc(Cl)n2nc1-c1cc(C)cc(F)c1
: