Target
Phosphatidylinositol 3-kinase regulatory subunit beta
Ligand
BDBM350447
Substrate
Meas. Tech.
Transcreener KINASE Assay
IC50
133±n/a nM
Citation
 Su, WDai, GZhang, WDeng, W Imidazopyridazine compounds and their use US Patent  US10208066 Publication Date 2/19/2019 
Target
Name:
Phosphatidylinositol 3-kinase regulatory subunit beta
Synonyms:
P85B_HUMAN PI3-kinase subunit p85-beta PIK3R2 PtdIns-3-kinase regulatory subunit beta | PtdIns-3-kinase regulatory subunit p85-beta
Type:
Enzyme Subunit
Mol. Mass.:
81542.75
Organism:
Homo sapiens (Human)
Description:
O00459
Residue:
728
  
Inhibitor
Name:
BDBM350447
Synonyms:
(S)-4-amino-6-((1-(3-chloro-6-(2-hydroxyphenyl)imidazo[1,2-b]pyridazin-7-yl)ethyl)amino)pyrimidine-5-carbonitrile US10611777, Compound 69
Type:
Small organic molecule
Emp. Form.:
C20H17ClN8O
Mol. Mass.:
420.855
SMILES:
COc1ccccc1-c1nn2c(Cl)cnc2cc1[C@H](C)Nc1ncnc(N)c1C#N
: