Target
Mitogen-activated protein kinase 14
Ligand
BDBM16015
Substrate
biotinylated GST-ATF2
Meas. Tech.
Homogeneous Time-Resolved Fluorescence (HTRF) Enzyme Assay
pH
7±n/a
Temperature
295.15±n/a K
IC50
0.078±n/a nM
Citation
 Scapin, GPatel, SBLisnock, JBecker, JWLoGrasso, PV The structure of JNK3 in complex with small molecule inhibitors: structural basis for potency and selectivity. Chem Biol 10:705-12 (2003)  
Target
Name:
Mitogen-activated protein kinase 14
Synonyms:
CSAID-binding protein CSBP1 CSPB1 MAP kinase 14 MAP kinase p38 alpha MAPK14 MK14_HUMAN Mitogen-activated protein kinase p38 alpha Stress-activated protein kinase 2a | p38 MAP kinase alpha/beta
Type:
Serine/threonine-protein kinase
Mol. Mass.:
41286.76
Organism:
Homo sapiens (Human)
Description:
Q16539
Residue:
360
  
Inhibitor
Name:
BDBM16015
Synonyms:
CHEMBL252967 imidazole-pyrimidine compound 1
Type:
Small organic molecule
Emp. Form.:
C25H30Cl2N6
Mol. Mass.:
485.452
SMILES:
CCCn1c(nc(c1-c1ccnc(NC2CC2)n1)-c1ccc(Cl)c(Cl)c1)C1CCN(C)CC1
:
Substrate
Name:
biotinylated GST-ATF2
Synonyms:
ATF-2-GST Activating transcription factor 2 GST-ATF2 biotinylated activating transcription factor 2
Type:
Other Protein Type
Mol. Mass.:
12237.77
Organism:
Homo sapiens (Human)
Description:
Residue:
109