Target
Beta-secretase 1
Ligand
BDBM16024
Substrate
BACE Substrate Peptide
Meas. Tech.
In Vitro BACE1 Activity Assay
pH
4.5±n/a
Temperature
295.15±n/a K
IC50
98±n/a nM
Citation
 Stachel, SJCoburn, CASteele, TGCrouthamel, MCPietrak, BLLai, MTHolloway, MKMunshi, SKGraham, SLVacca, JP Conformationally biased P3 amide replacements of beta-secretase inhibitors. Bioorg Med Chem Lett 16:641-4 (2006)  
Target
Name:
Beta-secretase 1
Synonyms:
ASP2 Aspartyl protease 2 BACE1 Beta-secretase (BACE) Beta-secretase 1 (BACE 1) Beta-secretase 1 (BACE1) Beta-site amyloid precursor protein cleaving enzyme 1 Memapsin-2 beta-Secretase (BACE-1) | beta-Secretase (BACE1)
Type:
Protein
Mol. Mass.:
55755.10
Organism:
Homo sapiens (Human)
Description:
P56817
Residue:
501
  
Inhibitor
Name:
BDBM16024
Synonyms:
3-benzoyl-N-[(2S,3R)-4-(cyclopropylamino)-3-hydroxy-1-phenylbutan-2-yl]-5-(N-methylmethanesulfonamido)benzamide N-[(1S,2R)-1-benzyl-3-(cyclopropylamino)-2-hydroxypropyl]-3-[methyl(methylsulfonyl)amino]-5-(phenylcarbonyl)benzamide | compound 7e
Type:
Small organic molecule
Emp. Form.:
C29H33N3O5S
Mol. Mass.:
535.654
SMILES:
CN(c1cc(cc(c1)C(=O)c1ccccc1)C(=O)N[C@@H](Cc1ccccc1)[C@H](O)CNC1CC1)S(C)(=O)=O
:
Substrate
Name:
BACE Substrate Peptide
Synonyms:
BACE-1 Substrate Peptide
Type:
Peptide
Mol. Mass.:
1557.77
Organism:
Description:
It is a coumarin (CM)-labeled peptide containing an optimized cleavage sequence NFEV.
Residue:
12
CMREVNFEVEFR