Target
Beta-secretase 1
Ligand
BDBM16040
Substrate
APP_NFEV
Meas. Tech.
In Vitro BACE1 Activity Assay
pH
4.5±n/a
Temperature
310.15±n/a K
IC50
27±n/a nM
Citation
 Rajapakse, HANantermet, PGSelnick, HGMunshi, SMcGaughey, GBLindsley, SRYoung, MBLai, MTEspeseth, ASShi, XPColussi, DPietrak, BCrouthamel, MCTugusheva, KHuang, QXu, MSimon, AJKuo, LHazuda, DJGraham, SVacca, JP Discovery of oxadiazoyl tertiary carbinamine inhibitors of beta-secretase (BACE-1). J Med Chem 49:7270-3 (2006)  
Target
Name:
Beta-secretase 1
Synonyms:
ASP2 Aspartyl protease 2 BACE1 Beta-secretase (BACE) Beta-secretase 1 (BACE 1) Beta-secretase 1 (BACE1) Beta-site amyloid precursor protein cleaving enzyme 1 Memapsin-2 beta-Secretase (BACE-1) | beta-Secretase (BACE1)
Type:
Protein
Mol. Mass.:
55755.10
Organism:
Homo sapiens (Human)
Description:
P56817
Residue:
501
  
Inhibitor
Name:
BDBM16040
Synonyms:
(3-{[(1R)-1-(4-fluorophenyl)ethyl]carbamoyl}-5-(N-methylmethanesulfonamido)phenyl)methyl (2R)-2-amino-2-methyl-3-phenylpropanoate tertiary carbinamine derived inhibitor 7
Type:
Small organic molecule
Emp. Form.:
C28H32FN3O5S
Mol. Mass.:
541.634
SMILES:
C[C@@H](NC(=O)c1cc(COC(=O)[C@](C)(N)Cc2ccccc2)cc(c1)N(C)S(C)(=O)=O)c1ccc(F)cc1
:
Substrate
Name:
APP_NFEV
Synonyms:
Amyloid beta A4 protein precursor beta-site mutant
Type:
Other Protein Type
Mol. Mass.:
86933.39
Organism:
Homo sapiens (Human)
Description:
It is the fusion protein containing the maltose-binding protein at the N-terminal end connected to the full-length APP_NFEV.
Residue:
770