Target
Beta-secretase 1 [1-453]
Ligand
BDBM16047
Substrate
BACE Peptide Substrate
Meas. Tech.
Enzyme Inhibition Measurements
pH
4.5±n/a
Temperature
295.15±n/a K
IC50
0.6±n/a nM
Citation
 Hanessian, SYun, HHou, YYang, GBayrakdarian, MTherrien, EMoitessier, NRoggo, SVeenstra, STintelnot-Blomley, MRondeau, JMOstermeier, CStrauss, ARamage, PPaganetti, PNeumann, UBetschart, C Structure-based design, synthesis, and memapsin 2 (BACE) inhibitory activity of carbocyclic and heterocyclic peptidomimetics. J Med Chem 48:5175-90 (2005)  
Target
Name:
Beta-secretase 1 [1-453]
Synonyms:
ASP2 Aspartyl protease 2 BACE1 Beta-site APP cleaving enzyme 1 KIAA1149 Membrane-associated aspartic protease 2 | beta-Secretase (BACE-1)
Type:
Enzyme
Mol. Mass.:
50193.81
Organism:
Homo sapiens (Human)
Description:
Recombinant human BACE (SwissProt accession number P56817, amino acids 1-453 + a thrombin-cleavable C-kappa tag) was produced in-house using Sf9 insect cells.
Residue:
453
  
Inhibitor
Name:
BDBM16047
Synonyms:
(4S)-4-[(2S)-2-[(2R,4S,5S)-5-[(2S)-2-[(2S)-2-[(4S)-4-amino-4-formamidobutanoic acid]-3-methylbutanamido]butanediamido]-4-hydroxy-2,7-dimethyloctanamido]propanamido]-4-{[(1S)-1-carboxy-2-phenylethyl]carbamoyl}butanoic acid EVNXXAEF OM99-2
Type:
polypeptide
Emp. Form.:
C41H64N8O14
Mol. Mass.:
892.9921
SMILES:
CC(C)C[C@H](NC(=O)[C@H](CC(N)=O)NC(=O)[C@@H](NC(=O)[C@@H](N)CCC(O)=O)C(C)C)[C@@H](O)C[C@@H](C)C(=O)N[C@@H](C)C(=O)N[C@@H](CCC(O)=O)C(=O)N[C@@H](Cc1ccccc1)C(O)=O
:
Substrate
Name:
BACE Peptide Substrate
Synonyms:
Type:
Peptide
Mol. Mass.:
1917.56
Organism:
Description:
Peptide substrates were obtained from Bachem (Bubendorf, Switzerland).
Residue:
17
MCASEVNLDAEFKDNPH