Target
Coagulation factor XI
Ligand
BDBM350491
Substrate
Meas. Tech.
In Vitro Assay
Ki
54.9±n/a nM
Citation
 Pinto, DJCorte, JRYang, WEwing, WR Macrocycles as factor XIa inhibitors US Patent  US10208068 Publication Date 2/19/2019 
Target
Name:
Coagulation factor XI
Synonyms:
Coagulation factor XIa Coagulation factor XIa light chain FA11_HUMAN Factor XIa PTA | Plasma thromboplastin antecedent
Type:
Enzyme
Mol. Mass.:
70130.58
Organism:
Homo sapiens (Human)
Description:
P03951
Residue:
625
  
Inhibitor
Name:
BDBM350491
Synonyms:
Methyl N-[(10R,14S)-14-[1-(3-chloro-2-fluorophenyl)-5-methyl-1H-pyrazole-4-amido]-11-hydroxy-10-methyl-9-oxo-8,16-diazatricyclo[13.3.1.02,7]nonadeca-1(19),2(7),3,5,15,17-hexaen-5-yl]carbamate, TFA salt | US10208068, Example 177
Type:
Small organic molecule
Emp. Form.:
C31H30ClFN6O5
Mol. Mass.:
621.059
SMILES:
COC(=O)Nc1ccc-2c(NC(=O)[C@H](C)C(O)CC[C@H](NC(=O)c3cnn(c3C)-c3cccc(Cl)c3F)c3cc-2ccn3)c1
: