Target
Coagulation factor XI
Ligand
BDBM350494
Substrate
Meas. Tech.
In Vitro Assay
Ki
153±n/a nM
Citation
 Pinto, DJCorte, JRYang, WEwing, WR Macrocycles as factor XIa inhibitors US Patent  US10208068 Publication Date 2/19/2019 
Target
Name:
Coagulation factor XI
Synonyms:
Coagulation factor XIa Coagulation factor XIa light chain FA11_HUMAN Factor XIa PTA | Plasma thromboplastin antecedent
Type:
Enzyme
Mol. Mass.:
70130.58
Organism:
Homo sapiens (Human)
Description:
P03951
Residue:
625
  
Inhibitor
Name:
BDBM350494
Synonyms:
US10208068, Example 207
Type:
Small organic molecule
Emp. Form.:
C28H26ClF2N8O4
Mol. Mass.:
612.007
SMILES:
COC(=O)Nc1ccc2-c3cnc(n3)[C@H](CCC[C@@H](C)C(=O)Nc2c1)NC(=O)c1nnn(c1C)-c1c(F)ccc(Cl)c1F
: