Target
Beta-secretase 1 [1-453]
Ligand
BDBM16084
Substrate
BACE Peptide Substrate
Meas. Tech.
Enzyme Inhibition Measurements
Temperature
298.15±n/a K
IC50
156±n/a nM
Comments
extracted
Citation
 Hanessian, SYang, GRondeau, JMNeumann, UBetschart, CTintelnot-Blomley, M Structure-based design and synthesis of macroheterocyclic peptidomimetic inhibitors of the aspartic protease beta-site amyloid precursor protein cleaving enzyme (BACE). J Med Chem 49:4544-67 (2006)  
Target
Name:
Beta-secretase 1 [1-453]
Synonyms:
ASP2 Aspartyl protease 2 BACE1 Beta-site APP cleaving enzyme 1 KIAA1149 Membrane-associated aspartic protease 2 | beta-Secretase (BACE-1)
Type:
Enzyme
Mol. Mass.:
50193.81
Organism:
Homo sapiens (Human)
Description:
Recombinant human BACE (SwissProt accession number P56817, amino acids 1-453 + a thrombin-cleavable C-kappa tag) was produced in-house using Sf9 insect cells.
Residue:
453
  
Inhibitor
Name:
BDBM16084
Synonyms:
AXQ093 tert-butyl {(3R,6S,9R,13E)-3-[(1S,3R)-4-{[(1S)-1-(butylcarbamoyl)-2-methylpropyl]amino}-1-hydroxy-3-methyl-4-oxobutyl]-6-methyl-5,8-dioxo-1,11-dithia-4,7-diazacyclopentadec-13-en-9-yl}carbamate | trans-dithia macrocycle compound 42
Type:
Small organic molecule
Emp. Form.:
C31H55N5O7S2
Mol. Mass.:
673.928
SMILES:
CCCCNC(=O)[C@@H](NC(=O)[C@H](C)C[C@H](O)[C@@H]1CSC\C=C\CSC[C@H](NC(=O)OC(C)(C)C)C(=O)N[C@@H](C)C(=O)N1)C(C)C
:
Substrate
Name:
BACE Peptide Substrate
Synonyms:
Type:
Peptide
Mol. Mass.:
1917.56
Organism:
Description:
Peptide substrates were obtained from Bachem (Bubendorf, Switzerland).
Residue:
17
MCASEVNLDAEFKDNPH