Target
Cathepsin D
Ligand
BDBM16080
Substrate
Cathepsin D Peptide Substrate
Meas. Tech.
Enzyme Inhibition Measurements
Temperature
298.15±n/a K
IC50
910±n/a nM
Comments
extracted
Citation
 Hanessian, SYang, GRondeau, JMNeumann, UBetschart, CTintelnot-Blomley, M Structure-based design and synthesis of macroheterocyclic peptidomimetic inhibitors of the aspartic protease beta-site amyloid precursor protein cleaving enzyme (BACE). J Med Chem 49:4544-67 (2006)  
Target
Name:
Cathepsin D
Synonyms:
CATD_HUMAN CTSD Cathepsin D heavy chain Cathepsin D precursor
Type:
Enzyme
Mol. Mass.:
44551.72
Organism:
Homo sapiens (Human)
Description:
Human proCathepsin D (SwissProt accession number P07339) was expressed in Sf9 cells, purified, and autoactivated.
Residue:
412
  
Inhibitor
Name:
BDBM16080
Synonyms:
Olefins were mixtures of cis and trans isomers. tert-butyl N-[(3S,6S,9S,13Z)-3-[(1S,3R)-3-(butylcarbamoyl)-1-hydroxy-3-methylpropyl]-6-methyl-5,8-dioxo-1,11-dioxa-4,7-diazacyclopentadec-13-en-9-yl]carbamate | tert-butyl {(3S,6S,9S,13Z)-3-[(1S,3R)-4-(butylamino)-1-hydroxy-3-methyl-4-oxobutyl]-6-methyl-5,8-dioxo-1,11-dioxa-4,7-diazacyclopentadec-13-en-9-yl}carbamate
Type:
Small organic molecule
Emp. Form.:
C26H46N4O8
Mol. Mass.:
542.6654
SMILES:
CCCCNC(=O)[C@H](C)C[C@H](O)[C@@H]1COC\C=C/COC[C@H](NC(=O)OC(C)(C)C)C(=O)N[C@@H](C)C(=O)N1
:
Substrate
Name:
Cathepsin D Peptide Substrate
Synonyms:
Type:
Peptide
Mol. Mass.:
2375.29
Organism:
Description:
Peptide substrates were obtained from Bachem (Bubendorf, Switzerland).
Residue:
20