Target
Cathepsin D
Ligand
BDBM16092
Substrate
Cathepsin D Peptide Substrate
Meas. Tech.
Enzyme Inhibition Measurements
Temperature
298.15±n/a K
IC50
6900±n/a nM
Comments
extracted
Citation
 Hanessian, SYang, GRondeau, JMNeumann, UBetschart, CTintelnot-Blomley, M Structure-based design and synthesis of macroheterocyclic peptidomimetic inhibitors of the aspartic protease beta-site amyloid precursor protein cleaving enzyme (BACE). J Med Chem 49:4544-67 (2006)  
Target
Name:
Cathepsin D
Synonyms:
CATD_HUMAN CTSD Cathepsin D heavy chain Cathepsin D precursor
Type:
Enzyme
Mol. Mass.:
44551.72
Organism:
Homo sapiens (Human)
Description:
Human proCathepsin D (SwissProt accession number P07339) was expressed in Sf9 cells, purified, and autoactivated.
Residue:
412
  
Inhibitor
Name:
BDBM16092
Synonyms:
(2R,4S)-4-[(4aS,12R,15S,17aR)-15-methyl-14,17-dioxo-1H,2H,3H,4H,4aH,5H,6H,9H,11H,12H,13H,14H,15H,16H,17H,17aH-pyrido[2,3-i][,,]cyclopentadecan-12-yl]-N-butyl-4-hydroxy-2-methylbutanamide bicyclic macrocycle compound 84
Type:
Small organic molecule
Emp. Form.:
C25H44N4O4S
Mol. Mass.:
496.706
SMILES:
CCCCNC(=O)[C@H](C)C[C@H](O)[C@@H]1CSC\C=C\CC[C@H]2CCCN[C@H]2C(=O)N[C@@H](C)C(=O)N1
:
Substrate
Name:
Cathepsin D Peptide Substrate
Synonyms:
Type:
Peptide
Mol. Mass.:
2375.29
Organism:
Description:
Peptide substrates were obtained from Bachem (Bubendorf, Switzerland).
Residue:
20