Target
N-formyl peptide receptor 2
Ligand
BDBM350506
Substrate
Meas. Tech.
FLIPR
EC50
120000±n/a nM
Citation
 Beard, RLDonello, JEViswanath, V Use of agonists of formyl peptide receptor 2 for treating ocular inflammatory diseases US Patent  US10208071 Publication Date 2/19/2019 
Target
Name:
N-formyl peptide receptor 2
Synonyms:
ALXR, FPRL1, FPR2 FPR2 FPRH1 Formyl Peptide Receptor-Like 1 LXA4 receptor Lipoxin A4 receptor RFP | hFPRL
Type:
G Protein-Coupled Receptor (GPCR)
Mol. Mass.:
38968.35
Organism:
Homo sapiens (Human)
Description:
P25090
Residue:
351
  
Inhibitor
Name:
BDBM350506
Synonyms:
(2S)-3-phenyl-2-[({[4- (trifluoromethyl)phenyl]amino}carbonyl) amino]propanoic acid US10434112, Table 1.3 | US10799518, Structure TABLE 1.3
Type:
Small organic molecule
Emp. Form.:
C17H15F3N2O3
Mol. Mass.:
352.3078
SMILES:
OC(=O)C(Cc1ccccc1)NC(=O)Nc1ccc(cc1)C(F)(F)F
: