Target
N-formyl peptide receptor 2
Ligand
BDBM350563
Substrate
Meas. Tech.
FLIPR
EC50
10500±n/a nM
Citation
 Beard, RLDonello, JEViswanath, V Use of agonists of formyl peptide receptor 2 for treating ocular inflammatory diseases US Patent  US10208071 Publication Date 2/19/2019 
Target
Name:
N-formyl peptide receptor 2
Synonyms:
ALXR, FPRL1, FPR2 FPR2 FPRH1 Formyl Peptide Receptor-Like 1 LXA4 receptor Lipoxin A4 receptor RFP | hFPRL
Type:
G Protein-Coupled Receptor (GPCR)
Mol. Mass.:
38968.35
Organism:
Homo sapiens (Human)
Description:
P25090
Residue:
351
  
Inhibitor
Name:
BDBM350563
Synonyms:
1-{3-(5-fluoropyridin-2-yl)-2- [2-(1H-imidazol-4-yl)ethyl]-1- oxo-1,2,3,4- tetrahydroisoquinolin-7-yl}-3- [4-(methylsulfonyl)phenyl]urea US10434112, Compound 25 | US10799518, Compound 25
Type:
Small organic molecule
Emp. Form.:
C27H25FN6O4S
Mol. Mass.:
548.589
SMILES:
CS(=O)(=O)c1ccc(NC(=O)Nc2ccc3CC(N(CCc4c[nH]cn4)C(=O)c3c2)c2ccc(F)cn2)cc1
: