Target
N-formyl peptide receptor 2
Ligand
BDBM350575
Substrate
Meas. Tech.
FLIPR
EC50
17000±n/a nM
Citation
 Beard, RLDonello, JEViswanath, V Use of agonists of formyl peptide receptor 2 for treating ocular inflammatory diseases US Patent  US10208071 Publication Date 2/19/2019 
Target
Name:
N-formyl peptide receptor 2
Synonyms:
ALXR, FPRL1, FPR2 FPR2 FPRH1 Formyl Peptide Receptor-Like 1 LXA4 receptor Lipoxin A4 receptor RFP | hFPRL
Type:
G Protein-Coupled Receptor (GPCR)
Mol. Mass.:
38968.35
Organism:
Homo sapiens (Human)
Description:
P25090
Residue:
351
  
Inhibitor
Name:
BDBM350575
Synonyms:
7,7-dimethyl-N-[4-(methylsulfanyl) phenyl]bicyclo[2.2.1]heptane- 2,3-dicarboxamide US10434112, Compound 37 | US10799518, Compound 37
Type:
Small organic molecule
Emp. Form.:
C18H24N2O2S
Mol. Mass.:
332.46
SMILES:
CSc1ccc(NC(=O)C2C3CCC(C2C(N)=O)C3(C)C)cc1
: