Target
N-formyl peptide receptor 2
Ligand
BDBM350576
Substrate
Meas. Tech.
FLIPR
EC50
1900±n/a nM
Citation
 Beard, RLDonello, JEViswanath, V Use of agonists of formyl peptide receptor 2 for treating ocular inflammatory diseases US Patent  US10208071 Publication Date 2/19/2019 
Target
Name:
N-formyl peptide receptor 2
Synonyms:
ALXR, FPRL1, FPR2 FPR2 FPRH1 Formyl Peptide Receptor-Like 1 LXA4 receptor Lipoxin A4 receptor RFP | hFPRL
Type:
G Protein-Coupled Receptor (GPCR)
Mol. Mass.:
38968.35
Organism:
Homo sapiens (Human)
Description:
P25090
Residue:
351
  
Inhibitor
Name:
BDBM350576
Synonyms:
N-(4-iodophenyl) spiro[bicyclo[2.2.1]heptane- 7,1'-cyclopropane]-2,3- dicarboxamide US10434112, Compound 38 | US10799518, Compound 38
Type:
Small organic molecule
Emp. Form.:
C17H19IN2O2
Mol. Mass.:
410.2494
SMILES:
NC(=O)C1C2CCC(C1C(=O)Nc1ccc(I)cc1)C21CC1
: